# Errors in installing Aspect on TACC-Frontera

**URL:** <https://community.geodynamics.org/t/errors-in-installing-aspect-on-tacc-frontera/2843>\
**Category:** ASPECT\
**Tags:** installation\
**Created:** [March 3, 2023, 3:22am UTC](https://community.geodynamics.org/t/errors-in-installing-aspect-on-tacc-frontera/2843 "2023-03-03T03:22:15Z")\
**Posts on this page:** 6\
**Page:** 1

<div class="post-metadata">

**Author:** ![Likhang](https://avatars.discourse-cdn.com/v4/letter/l/ecc23a/32.png) [@Likhang](https://community.geodynamics.org/u/Likhang)\
**Post date:** [March 3, 2023, 3:22am UTC](https://community.geodynamics.org/t/errors-in-installing-aspect-on-tacc-frontera/2843/1 "2023-03-03T03:22:15Z")

</div>

Hello,

I am new to Aspect. I followed the procedures of installing Aspect on TACC Stampede2 ([Compiling and Running ASPECT on TACC Stampede2 · geodynamics/aspect Wiki · GitHub](https://github.com/geodynamics/aspect/wiki/Compiling-and-Running-ASPECT-on-TACC-Stampede2)), as I suppose it will be similar to Frontera. When I tried to install candi by typing " ```  
./candi.sh -j 48 --prefix=“$WORK2”/software/candi/install/

```auto
...
[60%] Built target isorropia_test_utils
Consolidate compiler generated dependencies of target amesos2
Consolidate compiler generated dependencies of target ifpack
[62%] Built target amesos2
Consolidate compiler generated dependencies of target xpetra-sup
[65%] Built target ifpack
[65%] Built target xpetra-sup
Consolidate compiler generated dependencies of target galeri-xpetra
Consolidate compiler generated dependencies of target galeri-epetra
[65%] Built target galeri-xpetra
Consolidate compiler generated dependencies of target belos
[66%] Built target galeri-epetra
Consolidate compiler generated dependencies of target zoltan2
[66%] Built target belos
Consolidate compiler generated dependencies of target belosxpetra
Consolidate compiler generated dependencies of target belosepetra
[67%] Built target zoltan2
[67%] Built target belosxpetra
[67%] Built target belosepetra
Consolidate compiler generated dependencies of target belostpetra
Consolidate compiler generated dependencies of target ml
[69%] Built target belostpetra
Consolidate compiler generated dependencies of target anasazi
Consolidate compiler generated dependencies of target anasaziepetra
Consolidate compiler generated dependencies of target anasazitpetra
[76%] Built target ml
Consolidate compiler generated dependencies of target ModeLaplace
[76%] Built target anasazi
[76%] Built target anasaziepetra
[76%] Built target anasazitpetra
[76%] Built target ModeLaplace
Consolidate compiler generated dependencies of target stratimikosifpack
Consolidate compiler generated dependencies of target stratimikosml
Consolidate compiler generated dependencies of target stratimikosamesos
Consolidate compiler generated dependencies of target stratimikosaztecoo
Consolidate compiler generated dependencies of target stratimikosbelos
[76%] Built target stratimikosifpack
Consolidate compiler generated dependencies of target stratimikosamesos2
[77%] Built target stratimikosml
[78%] Built target stratimikosaztecoo
[78%] Built target stratimikosbelos
[78%] Built target stratimikosamesos
[78%] Built target stratimikosamesos2
Consolidate compiler generated dependencies of target stratimikos
[78%] Built target stratimikos
Consolidate compiler generated dependencies of target teko
[78%] Linking CXX shared library libteko.so
/opt/apps/gcc/8.3.0/bin/ld: CMakeFiles/teko.dir/NS/Teko_InvLSCStrategy.cpp.o: file not recognized: file truncated
make[2]: *** [packages/teko/src/libteko.so.13.2] Error 1
make[1]: *** [packages/teko/src/CMakeFiles/teko.dir/all] Error 2
make: *** [all] Error 2
Failure with exit status: 2
Exit message: There was a problem building trilinos 13-2-0.

I don't know what these errors mean. Anyone has any ideas? Thank you very much!

Lihang
```

---

<div class="post-metadata">

**Author:** ![Likhang](https://avatars.discourse-cdn.com/v4/letter/l/ecc23a/32.png) [@Likhang](https://community.geodynamics.org/u/Likhang)\
**Post date:** [March 3, 2023, 4:47am UTC](https://community.geodynamics.org/t/errors-in-installing-aspect-on-tacc-frontera/2843/2 "2023-03-03T04:47:02Z")

</div>

Problem solved. Nevermind.

---

<div class="post-metadata">

**Author:** ![bangerth](https://yyz2.discourse-cdn.com/flex036/user_avatar/community.geodynamics.org/bangerth/32/52_2.png) [@bangerth](https://community.geodynamics.org/u/bangerth)\
**Post date:** [March 3, 2023, 6:54pm UTC](https://community.geodynamics.org/t/errors-in-installing-aspect-on-tacc-frontera/2843/3 "2023-03-03T18:54:24Z")

</div>

@Likhang I bet you ran out of disk space, right? Or memory during compilation?  
Best  
W.

---

<div class="post-metadata">

**Author:** ![tjhei](https://yyz2.discourse-cdn.com/flex036/user_avatar/community.geodynamics.org/tjhei/32/1163_2.png) [@tjhei](https://community.geodynamics.org/u/tjhei)\
**Post date:** [March 3, 2023, 7:38pm UTC](https://community.geodynamics.org/t/errors-in-installing-aspect-on-tacc-frontera/2843/4 "2023-03-03T19:38:37Z")

</div>

Also, there is a guide for Frontera: [Installation on Frontera · geodynamics/aspect Wiki · GitHub](https://github.com/geodynamics/aspect/wiki/Installation-on-Frontera)

---

<div class="post-metadata">

**Author:** ![Likhang](https://avatars.discourse-cdn.com/v4/letter/l/ecc23a/32.png) [@Likhang](https://community.geodynamics.org/u/Likhang)\
**Post date:** [March 4, 2023, 3:37am UTC](https://community.geodynamics.org/t/errors-in-installing-aspect-on-tacc-frontera/2843/5 "2023-03-04T03:37:37Z")

</div>

Hi Wolfgang,

I think the problem was related to trilinos version. I changed it into 12-18-1, and it works. (I followed the instructions from a previous discussion, and it addresses my problem.)

Thanks,  
L

 ![image](https://canada1.discourse-cdn.com/flex036/uploads/geodynamics/original/2X/2/2a433a787e40c449d30d91bc9bafbb7685a74c0c.png)

---

<div class="post-metadata">

**Author:** ![Likhang](https://avatars.discourse-cdn.com/v4/letter/l/ecc23a/32.png) [@Likhang](https://community.geodynamics.org/u/Likhang)\
**Post date:** [March 4, 2023, 3:38am UTC](https://community.geodynamics.org/t/errors-in-installing-aspect-on-tacc-frontera/2843/6 "2023-03-04T03:38:36Z")

</div>

Thank you! My problem is solved.
